{"text_format":"1","workbook":"xlsx","n_sheets":16,"sheets":["Title sheet","Inputs","Base case","Base case disaggregated","SA","SAAbs","SAProd","SATurnover","SAHealth","SASoc","SAEff","Slider","Four-way","Four-way Prod","Four-way Turnover","Sheet1"],"not_rendered":{"charts":51,"images":3,"macros":1,"external_links":0,"defined_names":5,"comments":2,"pivot_tables":0},"unopened":[],"bounds":{"document_bytes":16777216,"sheet_cells":100000,"rows_first":2000,"rows_last":500,"rows_between":2000,"halvings":0,"cell_chars":16384,"cell_head_chars":4096},"cells_cut":0,"cells_raw":0,"read":"whole","date_system":"1900"}

{"sheet":"Title sheet","index":0,"n_rows":26,"n_cols":6,"rows_kept":26,"cut":false,"hidden":false,"merged":[[3,2,3,3],[6,3,8,10],[20,3,24,11],[25,3,28,11]]}
[]
[]
[]
[null,null,"XXXXXXXXXXX"]
[]
[]
[null,null,null,"Interventions to Support Workplace Health in Employees with Disabilities and Long-Term Conditions - Cost Calculator"]
[]
[]
[]
[]
[null,null,null,"About the model:"]
[]
[null,null,null,"Black text",null,"Indicates input cells. These can be changed as appropriate to your requirements."]
[]
{"$rows_left_out":12}
{"sheet":"Inputs","index":1,"n_rows":239,"n_cols":163,"rows_kept":239,"cut":false,"hidden":false,"merged":[[31,67,31,71],[42,67,42,71],[20,60,21,60],[20,61,21,61],[20,62,21,62],[20,63,21,63],[20,64,21,64],[43,55,44,55],[43,54,44,54],[43,53,44,53],[18,11,19,11],[3,2,3,3],[18,7,19,7],[18,8,19,8],[18,9,19,9],[18,10,19,10],[19,55,20,55],[19,54,20,54],[19,53,20,53],[31,55,32,55],[31,54,32,54],[31,53,32,53],[19,143,19,146],[19,149,19,152],[19,155,19,158],[43,57,44,57],[43,56,44,56],[19,56,20,56],[31,57,32,57],[31,56,32,56],[19,57,20,57],[31,60,31,64],[42,60,42,64],[20,71,21,71],[20,70,21,70],[20,69,21,69],[20,68,21,68],[20,67,21,67],[33,141,43,141],[45,141,55,141],[39,162,40,162],[39,161,40,161],[21,141,31,141]]}
[]
[]
[]
[]
[]
[]
[]
[]
[]
[null,null,null,"Select number of years",null,null,null,null,null,null,null,null,null,null,null,null,null,null,null,null,null,null,null,null,null,null,null,null,null,null,null,null,null,null,"Slider chart",null,null,null,null,null,"Sensitivity analysis"]
[null,null,null,null,null,null,null,null,null,null,null,null,null,null,null,null,null,null,null,null,null,null,null,null,null,null,null,null,null,null,null,null,null,null,null,"LIVE","Spin button"]
[null,null,null,"Effectiveness input method",null,null,null,null,null,null,null,null,null,null,null,null,null,null,null,null,null,null,null,null,null,null,null,null,null,null,null,null,null,null,"No of employees",{"$f":"IF('Base case'!$E$126=1,Inputs!AK12,Inputs!E14)","v":30},30,null,null,null,null,null,null,"Scenario analysis - baselien absenteeism"]
[null,null,null,null,null,null,null,null,null,null,null,null,null,null,null,null,null,null,null,null,null,null,null,null,null,null,null,null,null,null,null,null,null,null,null,null,null,null,null,null,"Cost of int.",{"$f":"'Base case'!G19","v":-12971.499561465691},null,"No. of days",{"$f":"'Base case'!G19","v":-12971.499561465691}]
[null,null,null,"Number of employees",30,null,null,null,null,null,null,null,null,null,null,null,null,null,null,null,null,null,null,null,null,null,null,null,null,null,null,null,null,null,"Cost of intervention per person",{"$f":"IF('Base case'!$E$126=1,Inputs!AK14,Inputs!H17)","v":311},311,null,null,null,0,-22301.499561465691,null,4.78,-12971.499561465691,null,null,null,null,null,null,null,"Drop down effectiveness options"]
[null,null,null,null,null,null,null,null,null,null,null,null,null,null,null,null,null,null,null,null,null,null,null,null,null,null,null,null,null,null,null,null,null,null,null,null,null,null,null,null,50,-20801.499561465691,null,7.58,-17343.22569454187,null,null,null,null,null,null,null,null,null,null,null,null,null,null,"Calculations"]
{"$rows_left_out":225}
{"sheet":"Base case","index":2,"n_rows":127,"n_cols":7,"rows_kept":127,"cut":false,"hidden":false,"merged":[[3,2,3,3]]}
[]
[]
[]
[null,null,"XXXXXXXXXXX"]
[]
[]
[]
[]
[]
[null,null,null,"Display results for:"]
[]
[null,null,null,null,"No intervention","Intervention","Incremental cost"]
[null,null,null,"Cost of absenteeism",{"$f":"CHOOSE(Inputs!$D$130,Inputs!BI45,Inputs!BJ45,Inputs!BK45,Inputs!BL45,Inputs!BM45)","v":21323.317261330762},{"$f":"CHOOSE(Inputs!$D$130,Inputs!BP45,Inputs!BQ45,Inputs!BR45,Inputs!BS45,Inputs!BT45)","v":13860.156219864995},{"$f":"F13-E13","v":-7463.1610414657662}]
[null,null,null,"Productivity",{"$f":"CHOOSE(Inputs!$D$130,Inputs!BI46,Inputs!BJ46,Inputs!BK46,Inputs!BL46,Inputs!BM46)","v":1614420},{"$f":"CHOOSE(Inputs!$D$130,Inputs!BP46,Inputs!BQ46,Inputs!BR46,Inputs!BS46,Inputs!BT46)","v":1616034.42},{"$f":"E14-F14","v":-1614.4199999999255}]
[null,null,null,"Cost of staff turnover",{"$f":"CHOOSE(Inputs!$D$130,Inputs!BI47,Inputs!BJ47,Inputs!BK47,Inputs!BL47,Inputs!BM47)","v":58772.9712},{"$f":"CHOOSE(Inputs!$D$130,Inputs!BP47,Inputs!BQ47,Inputs!BR47,Inputs!BS47,Inputs!BT47)","v":45549.052680000001},{"$f":"F15-E15","v":-13223.918519999999}]
{"$rows_left_out":113}
{"sheet":"Base case disaggregated","index":3,"n_rows":127,"n_cols":49,"rows_kept":127,"cut":false,"hidden":false,"merged":[[3,2,3,3],[11,4,11,8],[22,4,22,8]]}
[]
[]
[]
[null,null,"XXXXXXXXXXX"]
[]
[]
[]
[]
[]
[]
[null,null,null,"Before intervention"]
[null,null,null,null,"Cumulative discounted results"]
[null,null,null,null,"Year 1","Year 2","Year 3","Year 4","Year 5"]
[null,null,null,{"$f":"'Base case'!D13","v":"Cost of absenteeism"},{"$f":"Inputs!BI45","v":21323.317261330762},{"$f":"Inputs!BJ45","v":41925.556161167246},{"$f":"Inputs!BK45","v":61831.100991927138},{"$f":"Inputs!BL45","v":81063.511456429449},{"$f":"Inputs!BM45","v":99645.550552566943},null,null,null,null,null,null,null,null,null,null,null,null,null,null,null,null,null,null,null,null,null,null,null,null,null,null,null,null,null,null,null,"Before","After","Difference"]
[null,null,null,{"$f":"'Base case'!D14","v":"Productivity"},{"$f":"Inputs!BI46","v":1614420},{"$f":"Inputs!BJ46","v":3174246.086956522},{"$f":"Inputs!BK46","v":4681324.4318420505},{"$f":"Inputs!BL46","v":6137438.774726619},{"$f":"Inputs!BM46","v":7544312.5359677486},null,null,null,null,null,null,null,null,null,null,null,null,null,null,null,null,null,null,null,null,null,null,null,null,null,null,null,null,null,null,"Cost of absenteeism",25502.399999999998,22952.16,-2550.239999999998]
{"$rows_left_out":113}
{"sheet":"SA","index":4,"n_rows":120,"n_cols":49,"rows_kept":120,"cut":false,"hidden":false,"merged":[[3,2,3,3]]}
[]
[]
[]
[null,null,"XXXXXXXXXXX"]
[]
[]
[]
[]
[]
[]
[]
[]
[null,null,null,null,null,null,null,null,null,null,null,null,null,null,null,null,null,null,null,null,null,null,null,null,null,null,null,null,null,null,null,null,null,null,null,null,null,null,null,null,"Before","After","Difference"]
[null,null,null,null,null,null,null,null,null,null,null,null,null,null,null,null,null,null,null,null,null,null,null,null,null,null,null,null,null,null,null,null,null,null,null,null,null,null,null,"Cost of absenteeism",25502.399999999998,22952.16,-2550.239999999998]
[null,null,null,null,null,null,null,null,null,null,null,null,null,null,null,null,null,null,null,null,null,null,null,null,null,null,null,null,null,null,null,null,null,null,null,null,null,null,null,"Income from increased productivity",1185660,1197516.6000000001,-11856.600000000093]
{"$rows_left_out":106}
{"sheet":"SAAbs","index":5,"n_rows":119,"n_cols":49,"rows_kept":119,"cut":false,"hidden":false,"merged":[[3,2,3,3]]}
[]
[]
[]
[null,null,"XXXXXXXXXXX"]
[]
[]
[]
[]
[]
[]
[]
[]
[null,null,null,null,null,null,null,null,null,null,null,null,null,null,null,null,null,null,null,null,null,null,null,null,null,null,null,null,null,null,null,null,null,null,null,null,null,null,null,null,"Before","After","Difference"]
[null,null,null,null,null,null,null,null,null,null,null,null,null,null,null,null,null,null,null,null,null,null,null,null,null,null,null,null,null,null,null,null,null,null,null,null,null,null,null,"Cost of absenteeism",25502.399999999998,22952.16,-2550.239999999998]
[null,null,null,null,null,null,null,null,null,null,null,null,null,null,null,null,null,null,null,null,null,null,null,null,null,null,null,null,null,null,null,null,null,null,null,null,null,null,null,"Income from increased productivity",1185660,1197516.6000000001,-11856.600000000093]
{"$rows_left_out":105}
{"sheet":"SAProd","index":6,"n_rows":119,"n_cols":49,"rows_kept":119,"cut":false,"hidden":false,"merged":[[3,2,3,3]]}
[]
[]
[]
[null,null,"XXXXXXXXXXX"]
[]
[]
[]
[]
[]
[]
[]
[]
[null,null,null,null,null,null,null,null,null,null,null,null,null,null,null,null,null,null,null,null,null,null,null,null,null,null,null,null,null,null,null,null,null,null,null,null,null,null,null,null,"Before","After","Difference"]
[null,null,null,null,null,null,null,null,null,null,null,null,null,null,null,null,null,null,null,null,null,null,null,null,null,null,null,null,null,null,null,null,null,null,null,null,null,null,null,"Cost of absenteeism",25502.399999999998,22952.16,-2550.239999999998]
[null,null,null,null,null,null,null,null,null,null,null,null,null,null,null,null,null,null,null,null,null,null,null,null,null,null,null,null,null,null,null,null,null,null,null,null,null,null,null,"Income from increased productivity",1185660,1197516.6000000001,-11856.600000000093]
{"$rows_left_out":105}
{"sheet":"SATurnover","index":7,"n_rows":119,"n_cols":49,"rows_kept":119,"cut":false,"hidden":false,"merged":[[3,2,3,3]]}
[]
[]
[]
[null,null,"XXXXXXXXXXX"]
[]
[]
[]
[]
[]
[]
[]
[]
[null,null,null,null,null,null,null,null,null,null,null,null,null,null,null,null,null,null,null,null,null,null,null,null,null,null,null,null,null,null,null,null,null,null,null,null,null,null,null,null,"Before","After","Difference"]
[null,null,null,null,null,null,null,null,null,null,null,null,null,null,null,null,null,null,null,null,null,null,null,null,null,null,null,null,null,null,null,null,null,null,null,null,null,null,null,"Cost of absenteeism",25502.399999999998,22952.16,-2550.239999999998]
[null,null,null,null,null,null,null,null,null,null,null,null,null,null,null,null,null,null,null,null,null,null,null,null,null,null,null,null,null,null,null,null,null,null,null,null,null,null,null,"Income from increased productivity",1185660,1197516.6000000001,-11856.600000000093]
{"$rows_left_out":105}
{"sheet":"SAHealth","index":8,"n_rows":119,"n_cols":49,"rows_kept":119,"cut":false,"hidden":false,"merged":[[3,2,3,3]]}
[]
[]
[]
[null,null,"XXXXXXXXXXX"]
[]
[]
[]
[]
[]
[]
[]
[]
[null,null,null,null,null,null,null,null,null,null,null,null,null,null,null,null,null,null,null,null,null,null,null,null,null,null,null,null,null,null,null,null,null,null,null,null,null,null,null,null,"Before","After","Difference"]
[null,null,null,null,null,null,null,null,null,null,null,null,null,null,null,null,null,null,null,null,null,null,null,null,null,null,null,null,null,null,null,null,null,null,null,null,null,null,null,"Cost of absenteeism",25502.399999999998,22952.16,-2550.239999999998]
[null,null,null,null,null,null,null,null,null,null,null,null,null,null,null,null,null,null,null,null,null,null,null,null,null,null,null,null,null,null,null,null,null,null,null,null,null,null,null,"Income from increased productivity",1185660,1197516.6000000001,-11856.600000000093]
{"$rows_left_out":105}
{"sheet":"SASoc","index":9,"n_rows":119,"n_cols":49,"rows_kept":119,"cut":false,"hidden":false,"merged":[[3,2,3,3]]}
[]
[]
[]
[null,null,"XXXXXXXXXXX"]
[]
[]
[]
[]
[]
[]
[]
[]
[null,null,null,null,null,null,null,null,null,null,null,null,null,null,null,null,null,null,null,null,null,null,null,null,null,null,null,null,null,null,null,null,null,null,null,null,null,null,null,null,"Before","After","Difference"]
[null,null,null,null,null,null,null,null,null,null,null,null,null,null,null,null,null,null,null,null,null,null,null,null,null,null,null,null,null,null,null,null,null,null,null,null,null,null,null,"Cost of absenteeism",25502.399999999998,22952.16,-2550.239999999998]
[null,null,null,null,null,null,null,null,null,null,null,null,null,null,null,null,null,null,null,null,null,null,null,null,null,null,null,null,null,null,null,null,null,null,null,null,null,null,null,"Income from increased productivity",1185660,1197516.6000000001,-11856.600000000093]
{"$rows_left_out":105}
{"sheet":"SAEff","index":10,"n_rows":37,"n_cols":49,"rows_kept":37,"cut":false,"hidden":false,"merged":[[3,2,3,3]]}
[]
[]
[]
[null,null,"XXXXXXXXXXX"]
[]
[]
[]
[]
[]
[]
[]
[]
[null,null,null,null,null,null,null,null,null,null,null,null,null,null,null,null,null,null,null,null,null,null,null,null,null,null,null,null,null,null,null,null,null,null,null,null,null,null,null,null,"Before","After","Difference"]
[null,null,null,null,null,null,null,null,null,null,null,null,null,null,null,null,null,null,null,null,null,null,null,null,null,null,null,null,null,null,null,null,null,null,null,null,null,null,null,"Cost of absenteeism",25502.399999999998,22952.16,-2550.239999999998]
[null,null,null,null,null,null,null,null,null,null,null,null,null,null,null,null,null,null,null,null,null,null,null,null,null,null,null,null,null,null,null,null,null,null,null,null,null,null,null,"Income from increased productivity",1185660,1197516.6000000001,-11856.600000000093]
{"$rows_left_out":23}
{"sheet":"Slider","index":11,"n_rows":38,"n_cols":49,"rows_kept":38,"cut":false,"hidden":false,"merged":[[3,2,3,3]]}
[]
[]
[]
[null,null,"XXXXXXXXXXX"]
[]
[]
[]
[]
[]
[]
[null,null,null,null,"Before","After","Cost savings"]
[null,null,null,"Cost of absenteeism",{"$f":"'Base case'!E13","v":21323.317261330762},{"$f":"'Base case'!F13","v":13860.156219864995},{"$f":"'Base case'!G13","v":-7463.1610414657662}]
[null,null,null,"Income from productivity",{"$f":"'Base case'!E14","v":1614420},{"$f":"'Base case'!F14","v":1616034.42},{"$f":"'Base case'!G14","v":-1614.4199999999255},null,null,null,null,null,null,null,null,null,null,null,null,null,null,null,null,null,null,null,null,null,null,null,null,null,null,null,null,null,null,null,null,null,"Before","After","Difference"]
[null,null,null,"Cost of staff turnover",{"$f":"'Base case'!E15","v":58772.9712},{"$f":"'Base case'!F15","v":45549.052680000001},{"$f":"'Base case'!G15","v":-13223.918519999999},null,null,null,null,null,null,null,null,null,null,null,null,null,null,null,null,null,null,null,null,null,null,null,null,null,null,null,null,null,null,null,null,"Cost of absenteeism",25502.399999999998,22952.16,-2550.239999999998]
[null,null,null,{"$f":"Inputs!D31","v":"Placeholder 1"},{"$f":"'Base case'!E16","v":0},{"$f":"'Base case'!F16","v":0},{"$f":"'Base case'!G16","v":0},null,null,null,null,null,null,null,null,null,null,null,null,null,null,null,null,null,null,null,null,null,null,null,null,null,null,null,null,null,null,null,null,"Income from increased productivity",1185660,1197516.6000000001,-11856.600000000093]
{"$rows_left_out":24}
{"sheet":"Four-way","index":12,"n_rows":40,"n_cols":51,"rows_kept":40,"cut":false,"hidden":false,"merged":[[3,2,3,4]]}
[]
[]
[]
[null,null,"XXXXXXXXXXX"]
[]
[]
[null,null,null,null,null,null,null,"Please select category to view:",null,null,null,"Four-way SA inputs"]
[null,null,null,null,null,null,null,"Absenteeism",null,null,null,"Cost of intervention per person",0,200,400,600]
[null,null,null,null,null,null,null,"Productivity",null,null,null,null,"Low","Mid","High"]
[null,null,null,"Absenteeism",null,null,null,"Staff turnover",null,null,null,"Cost of absenteeism",50,148.69816779170685,300]
[null,null,null,null,null,null,null,null,null,null,null,"Baseline absenteeism (days)",2,5,17.2]
[null,null,null,null,null,"Cost of intervention"]
[]
[null,null,null,null,null,"1. Baseline absenteeism (days)",null,"2. Baseline absenteeism (days)",null,"3. Baseline absenteeism (days)"]
[null,null,null,null,null,{"$f":"M11","v":2},null,{"$f":"N11","v":5},null,{"$f":"O11","v":17.2},null,null,null,null,null,null,null,null,null,null,null,null,null,null,null,null,null,null,null,null,null,null,null,null,null,null,null,null,null,null,null,null,"Before","After","Difference"]
{"$rows_left_out":26}
{"sheet":"Four-way Prod","index":13,"n_rows":40,"n_cols":51,"rows_kept":40,"cut":false,"hidden":false,"merged":[[3,2,3,4]]}
[]
[]
[]
[null,null,"XXXXXXXXXXX"]
[]
[]
[null,null,null,null,null,null,null,"Please select category to view:",null,null,null,"Four-way SA inputs"]
[null,null,null,null,null,null,null,"Absenteeism",null,null,null,"Cost of intervention per person",0,200,400,600]
[null,null,null,null,null,null,null,"Productivity",null,null,null,null,"Low","Mid","High"]
[null,null,null,"Productivity",null,null,null,"Staff turnover",null,null,null,"Value of employee",20000,50000,75000]
[null,null,null,null,null,null,null,null,null,null,null,"Percentage of staff affected",0.5,0.75,1]
[null,null,null,null,null,"Cost of intervention"]
[]
[null,null,null,null,null,"1. Percentage affected",null,"2. Percentage affected",null,"3. Percentage affected"]
[null,null,null,null,null,{"$f":"M11","v":0.5},null,{"$f":"N11","v":0.75},null,{"$f":"O11","v":1},null,null,null,null,null,null,null,null,null,null,null,null,null,null,null,null,null,null,null,null,null,null,null,null,null,null,null,null,null,null,null,null,"Before","After","Difference"]
{"$rows_left_out":26}
{"sheet":"Four-way Turnover","index":14,"n_rows":40,"n_cols":51,"rows_kept":40,"cut":false,"hidden":false,"merged":[[3,2,3,4]]}
[]
[]
[]
[null,null,"XXXXXXXXXXX"]
[]
[]
[null,null,null,null,null,null,null,"Please select category to view:",null,null,null,"Four-way SA inputs"]
[null,null,null,null,null,null,null,"Absenteeism",null,null,null,"Cost of intervention per person",0,200,400,600]
[null,null,null,null,null,null,null,"Productivity",null,null,null,null,"Low","Mid","High"]
[null,null,null,"Staff turnover",null,null,null,"Staff turnover",null,null,null,"Cost per case",5000,14500,25000]
[null,null,null,null,null,null,null,null,null,null,null,"Baseline rate of turnover",0.05,0.13600000000000001,0.5]
[null,null,null,null,null,"Cost of intervention"]
[]
[null,null,null,null,null,"1. Baseline rate of turnover",null,"2. Baseline rate of turnover",null,"3. Baseline rate of turnover"]
[null,null,null,null,null,{"$f":"M11","v":0.05},null,{"$f":"N11","v":0.13600000000000001},null,{"$f":"O11","v":0.5},null,null,null,null,null,null,null,null,null,null,null,null,null,null,null,null,null,null,null,null,null,null,null,null,null,null,null,null,null,null,null,null,"Before","After","Difference"]
{"$rows_left_out":26}
{"sheet":"Sheet1","index":15,"n_rows":0,"n_cols":0,"rows_kept":0,"cut":false,"hidden":false,"merged":[]}