{"text_format":"1","workbook":"xlsx","n_sheets":10,"sheets":["Title sheet","Inputs","Inputs Main","Inputs Interventions","Cost Breakdown","Base case","SA","SAAbs","SAProd","SATurnover"],"not_rendered":{"charts":9,"images":4,"macros":1,"external_links":0,"defined_names":6,"comments":2,"pivot_tables":0},"unopened":[],"bounds":{"document_bytes":16777216,"sheet_cells":100000,"rows_first":2000,"rows_last":500,"rows_between":2000,"halvings":0,"cell_chars":16384,"cell_head_chars":4096},"cells_cut":0,"cells_raw":0,"read":"whole","date_system":"1900"}

{"sheet":"Title sheet","index":0,"n_rows":40,"n_cols":6,"rows_kept":40,"cut":false,"hidden":false,"merged":[[25,3,25,11],[22,3,24,11],[19,3,20,11],[26,3,27,11],[3,2,3,3],[6,3,8,10],[11,3,16,11]]}
[]
[]
[]
[null,null,"XXXXXXXXXXX"]
[]
[]
[null,null,null,"An economic evaluation of mental wellbeing interventions at work in England"]
[]
[]
[null,null,null,"About the model:"]
[]
[null,null,null,"This cost-calculator is intended for use by decision makers to determine if a mental health intervention at work is cost-saving for a specific organisation from the perspective of the employer.  The model is intended to be used as one decision making tool and should be used in conjunction with other tools/information. The baseline costs are provided as a starting point and as an example of the type of inputs that could be used.  However, the baseline inputs have high levels of uncertainty and should be used with care and caution. Each baseline input has a comment in the cell to indicate the input source. A variety of intervention types, based on evidence, have been included as a guide only. It is likely that the information required for the model will differ by organisation. Hence, it is intended that the user will input data specific to their own organisation (or the organisation where the intervention will be implemented) and that the results will supplement decision making.  The model should be used alongside the associated economic model report which is available on the NICE website."]
[]
[]
[]
[]
[]
[null,null,null,"Navigating the model:"]
[]
[null,null,null,"The rectangular buttons to the left hand side allow the user to navigate between sections. Chevron buttons at the top of each sheet allow the user to navigate to sub-sections within each section. "]
{"$rows_left_out":21}
{"sheet":"Inputs","index":1,"n_rows":216,"n_cols":45,"rows_kept":216,"cut":false,"hidden":false,"merged":[[3,2,3,3],[18,7,19,7]]}
[]
[]
[]
[]
[]
[]
[]
[]
[]
[null,null,null,null,null,null,null,null,null,null,null,null,null,null,null,null,null,null,null,null,null,null,null,null,null,null,null,null,null,null,"Slider chart",null,null,null,null,null,"Sensitivity analysis",null,null,null,null,null,null,"Calculations"]
[null,null,null,null,null,null,null,null,null,null,null,null,null,null,null,null,null,null,null,null,null,null,null,null,null,null,null,null,null,null,null,"LIVE","Spin button"]
[null,null,null,null,null,null,null,null,null,null,null,null,null,null,null,null,null,null,null,null,null,null,null,null,null,null,null,null,null,null,"No of employees",{"$f":"IF('Base case'!$E$127=1,Inputs!AG12,Inputs!E17)","v":50},100]
[null,null,null,null,null,null,null,null,null,null,null,null,null,null,null,null,null,null,null,null,null,null,null,null,null,null,null,null,null,null,null,null,null,null,null,null,"Cost of intervention",{"$f":"'Base case'!E20","v":5000},null,null,null,null,null,null,"Incremental"]
[null,null,null,null,null,null,null,null,null,null,null,null,null,null,null,null,null,null,null,null,null,null,null,null,null,null,null,null,null,null,"Cost of intervention per person",{"$f":"IF('Base case'!$E$127=1,Inputs!AG14,Inputs!H17)","v":100},100,null,null,null,0,0,null,null,null,null,null,{"$f":"$D$19","v":"Absenteeism (sick leave)"},{"$f":"H21*E17*E20","v":0}]
[null,null,null,"Intervention type","Manager mental health training",null,{"$f":"LOWER(E15)","v":"manager mental health training"},null,null,null,null,null,null,null,null,null,null,null,null,null,null,null,null,null,null,null,null,null,null,null,null,null,null,null,null,null,100,5000,null,null,null,null,null,{"$f":"$D$23","v":"Presenteeism"},{"$f":"H22*E17*E24","v":0}]
[null,null,null,null,null,null,null,"Per year",null,null,null,null,null,null,null,null,null,null,null,null,null,null,null,null,null,null,null,null,null,null,null,null,null,"Spin button default",null,null,200,10000,null,null,null,null,null,{"$f":"$D$27","v":"Staff turnover"},{"$f":"H23*E28","v":0}]
[null,null,null,"Number of employees",{"$f":"'Inputs Main'!E11","v":50},null,"Cost of intervention (person)",{"$f":"IF('Inputs Main'!I110=1,'Inputs Main'!I11/'Inputs Main'!E11,IF('Inputs Main'!I110=2,'Inputs Main'!I11,'Cost Breakdown'!E20/'Inputs Main'!E11))","v":100},null,null,null,null,null,null,null,null,null,null,null,null,null,null,null,null,null,null,null,null,null,null,"Cost of absenteeism per day",{"$f":"IF('Base case'!$E$127=1,Inputs!AG17,Inputs!E20)","v":153.97999999999999},153.97999999999999,null,null,null,300,15000,null,null,null,null,null,"Intervention cost",{"$f":"H17","v":100}]
[null,null,null,null,null,null,null,null,null,null,null,null,null,null,null,null,null,null,null,null,null,null,null,null,null,null,null,null,null,null,"Reduction in absenteeism",{"$f":"IF('Base case'!$E$127=1,Inputs!AG18,Inputs!H21)","v":0},0,{"$f":"AF18","v":0},null,null,400,20000,null,null,null,null,null,"Total",{"$f":"SUM(AS14:AS17)","v":100}]
[null,null,null,"Absenteeism (sick leave)","Baseline",null,null,"Per year",null,null,null,null,null,null,null,null,null,null,null,null,null,null,null,null,null,null,null,null,null,null,null,null,null,null,null,null,500,25000]
[null,null,null,"Cost of absenteeism per day",{"$f":"IF('Inputs Main'!F17=\"\",'Inputs Main'!E17,'Inputs Main'!F17)","v":153.97999999999999},null,null,null,null,null,null,null,null,null,null,null,null,null,null,null,null,null,null,null,null,null,null,null,null,null,null,null,null,null,null,null,600,30000]
{"$rows_left_out":197}
{"sheet":"Inputs Main","index":2,"n_rows":210,"n_cols":25,"rows_kept":210,"cut":false,"hidden":false,"merged":[[41,23,42,23],[41,24,42,24],[3,2,3,3]]}
[]
[]
[]
[]
[]
[]
[]
[]
[]
[]
[null,null,null,"Number of employees",50,null,null,"Cost of intervention",100]
[null,null,null,null,null,null,null,"Total"]
[null,null,null,"Intervention type",3,null,null,"Per person"]
[null,null,null,null,"(select from dropdown list)",null,null,"Using cost breakdown"]
[]
[null,null,null,null,"Baseline","User defined",null,null,"Effectiveness","User defined"]
[null,null,null,"Cost of absenteeism per day",153.97999999999999,null,null,"Reduction in absenteeism (in days)",{"$f":"IF(VLOOKUP(Inputs!$E$15,'Inputs Interventions'!$E$13:$I$27,3, FALSE)=0, \"No evidence\",VLOOKUP(Inputs!$E$15,'Inputs Interventions'!$E$13:$I$27,3, FALSE))","v":"No evidence"}]
[null,null,null,"Cost of presenteeism per day",307.95999999999998,null,null,"Reduction in presenteeism (in days)",{"$f":"IF(VLOOKUP(Inputs!$E$15,'Inputs Interventions'!$E$13:$I$27,4, FALSE)=0, \"No evidence\",VLOOKUP(Inputs!$E$15,'Inputs Interventions'!$E$13:$I$27,4, FALSE))","v":"No evidence"}]
[null,null,null,"Cost per case of staff turnover",14983.71,null,null,"Reduction in staff turnover (%)",{"$f":"IF(VLOOKUP(Inputs!$E$15,'Inputs Interventions'!$E$13:$I$27,5, FALSE)=0, \"No evidence\",VLOOKUP(Inputs!$E$15,'Inputs Interventions'!$E$13:$I$27,5, FALSE))","v":"No evidence"}]
[null,null,null,null,null,null,null,{"$f":"CONCATENATE(\"Reduction in \",D26)","v":"Reduction in "},0.1]
{"$rows_left_out":191}
{"sheet":"Inputs Interventions","index":3,"n_rows":197,"n_cols":29,"rows_kept":197,"cut":false,"hidden":false,"merged":[[3,2,3,3],[10,6,10,8],[10,3,11,3],[10,4,11,4],[10,5,11,5],[10,9,10,27],[94,3,95,3],[94,4,95,4],[94,5,95,5],[94,6,94,8],[94,9,94,28],[117,3,118,3],[117,4,118,4],[117,5,118,5],[117,6,117,8],[117,9,117,27]]}
[]
[]
[]
[]
[]
[]
[]
[]
[]
[]
[null,null,null,"ID","Intervention type","Description","Employer outcomes",null,null,"Employee outcomes"]
[null,null,null,null,null,null,"Reduction in absenteeism (days)","Reduction in presenteeism (days)","Reduction in staff turnover (point %)","Confidence identifying mental health","Uptake of support services","Communication and awareness of support","Managers mental health knowledge","Destigmatisation","Mental wellbeing","Mental wellbeing (based on non RCTs)","Mental health symptoms","Mental health symptoms (based on non RCTs)","Mental health literacy","Job stress","Job stress (based on non RCTs)","Job stress (based on RCTs reporting relative risk)","Job satisfaction","Job satisfaction (based on non RCTs)","Job satisfaction (based on RCTs reporting relative risk)","Work climate","Work climate (based on non RCTs)","Quality of life"]
[null,null,null,1,"Case study: Multicomponent health promotion","Mills (2007)",4.3,9.1999999999999993]
[null,null,null,2,"User defined","User defined"]
[null,null,null,3,"Manager mental health training","Universal manager-level",null,null,null,0.74,1.34,1.28,1.45,0.31]
[null,null,null,4,"Leadership development","Universal organisational-level",null,null,null,null,null,null,null,null,null,-0.09,null,null,null,null,null,null,null,0.01,null,null,0.06]
[null,null,null,5,"Peer support","Universal organisational-level",null,null,null,null,null,null,null,null,0.57999999999999996,null,null,null,null,-0.16,null,null,0.56999999999999995]
[null,null,null,6,"Mental health first aider","Universal organisational-level",null,null,null,null,null,null,null,null,0.06,null,-0.02,null,0.53]
[null,null,null,7,"Participatory approach ","Universal organisational-level",null,null,null,null,null,null,null,null,0.45,null,0.01,0.14000000000000001,null,0.34,0.15,-0.27,0.19,null,0.22,0.18,0.02]
[null,null,null,8,"Targeted cognitive behavioural theory","Targeted individual-level",1.83,4.03,null,null,null,null,null,null,0.48,null,0.36,null,0.02,0.15,null,null,-0.09]
{"$rows_left_out":178}
{"sheet":"Cost Breakdown","index":4,"n_rows":177,"n_cols":6,"rows_kept":177,"cut":false,"hidden":false,"merged":[[3,2,3,3],[12,3,12,4],[7,3,8,4]]}
[]
[]
[]
[]
[]
[]
[null,null,null,"Cost breakdown"]
[null,null,null,"If a breakdown of the costs associated with the intervention is available, this section can be used to calculate the overall cost of the intervention."]
[]
[null,null,null,null,"User defined"]
[null,null,null,"Participation costs"]
[null,null,null,"Delivery costs"]
[null,null,null,"Other costs"]
[null,null,null,"Premises hire"]
[null,null,null,"Equipment hire"]
[null,null,null,"Travel expenses"]
[null,null,null,"Accommodation, subsistence etc."]
[null,null,null,"Printing, books, materials etc."]
[null,null,null,"Other"]
[null,null,null,"Total intervention costs",{"$f":"SUM(E11:E19)","v":0}]
{"$rows_left_out":158}
{"sheet":"Base case","index":5,"n_rows":137,"n_cols":22,"rows_kept":137,"cut":false,"hidden":false,"merged":[[112,3,121,4],[111,3,111,4],[34,3,39,4],[3,2,3,3],[23,3,23,4],[24,3,33,4],[22,3,22,4]]}
[]
[]
[]
[null,null,"XXXXXXXXXXX"]
[]
[]
[]
[]
[]
[null,null,null,{"$f":"IF(Inputs!E15=\"Case study: Multicomponent health promotion\", \"The results are based on an unspecified mental wellbeing intervention.\", CONCATENATE(\"The results are based on a \",Inputs!G15, \" intervention.\"))","v":"The results are based on a manager mental health training intervention."}]
[null,null,null,"All results should be interpreted with caution."]
[]
[null,null,null,null,"One-year time horizon,"]
[null,null,null,null,{"$f":"CONCATENATE(\"per \",Inputs!AF12, \" employees\")","v":"per 50 employees"}]
[null,null,null,null,"Incremental cost"]
[null,null,null,"Cost of absenteeism",{"$f":"-Inputs!AF12*Inputs!AF17*Inputs!AF18","v":0}]
[null,null,null,"Cost of presenteeism",{"$f":"-Inputs!AF12*Inputs!AF21*Inputs!AF22","v":0}]
[null,null,null,"Cost of staff turnover",{"$f":"-Inputs!AF12*Inputs!AF25*Inputs!AF26","v":0}]
[null,null,null,"Intervention cost",{"$f":"Inputs!AF14*Inputs!AF12","v":5000}]
[null,null,null,"Total cost",{"$f":"SUM(E16:E19)","v":5000}]
{"$rows_left_out":118}
{"sheet":"SA","index":6,"n_rows":137,"n_cols":49,"rows_kept":137,"cut":false,"hidden":false,"merged":[[3,2,3,3],[121,3,121,7]]}
[]
[]
[]
[null,null,"XXXXXXXXXXX"]
[]
[]
[]
[]
[]
[]
[]
[]
[null,null,null,null,null,null,null,null,null,null,null,null,null,null,null,null,null,null,null,null,null,null,null,null,null,null,null,null,null,null,null,null,null,null,null,null,null,null,null,null,"Before","After","Difference"]
[null,null,null,null,null,null,null,null,null,null,null,null,null,null,null,null,null,null,null,null,null,null,null,null,null,null,null,null,null,null,null,null,null,null,null,null,null,null,null,"Cost of absenteeism",25502.399999999998,22952.16,-2550.239999999998]
[null,null,null,null,null,null,null,null,null,null,null,null,null,null,null,null,null,null,null,null,null,null,null,null,null,null,null,null,null,null,null,null,null,null,null,null,null,null,null,"Income from increased productivity",1185660,1197516.6000000001,-11856.600000000093]
[null,null,null,null,null,null,null,null,null,null,null,null,null,null,null,null,null,null,null,null,null,null,null,null,null,null,null,null,null,null,null,null,null,null,null,null,null,null,null,"Cost of staff turnover",50986.106557377047,42063.537909836065,-8922.5686475409821]
[null,null,null,null,null,null,null,null,null,null,null,null,null,null,null,null,null,null,null,null,null,null,null,null,null,null,null,null,null,null,null,null,null,null,null,null,null,null,null,"Healthcare costs",0,0,0]
[null,null,null,null,null,null,null,null,null,null,null,null,null,null,null,null,null,null,null,null,null,null,null,null,null,null,null,null,null,null,null,null,null,null,null,null,null,null,null,"Societal costs",0,0,0]
[null,null,null,null,null,null,null,null,null,null,null,null,null,null,null,null,null,null,null,null,null,null,null,null,null,null,null,null,null,null,null,null,null,null,null,null,null,null,null,"Intervention cost",0,6000,6000]
[null,null,null,null,1,null,null,null,null,null,null,null,null,null,null,null,null,null,null,null,null,null,null,null,null,null,null,null,null,null,null,null,null,null,null,null,null,null,null,"Total",1262148.5065573771,1268532.2979098361,-17329.408647541073]
{"$rows_left_out":118}
{"sheet":"SAAbs","index":7,"n_rows":137,"n_cols":49,"rows_kept":137,"cut":false,"hidden":false,"merged":[[3,2,3,3],[121,3,121,7]]}
[]
[]
[]
[null,null,"XXXXXXXXXXX"]
[]
[]
[]
[]
[]
[]
[]
[]
[null,null,null,null,null,null,null,null,null,null,null,null,null,null,null,null,null,null,null,null,null,null,null,null,null,null,null,null,null,null,null,null,null,null,null,null,null,null,null,null,"Before","After","Difference"]
[null,null,null,null,null,null,null,null,null,null,null,null,null,null,null,null,null,null,null,null,null,null,null,null,null,null,null,null,null,null,null,null,null,null,null,null,null,null,null,"Cost of absenteeism",25502.399999999998,22952.16,-2550.239999999998]
[null,null,null,null,null,null,null,null,null,null,null,null,null,null,null,null,null,null,null,null,null,null,null,null,null,null,null,null,null,null,null,null,null,null,null,null,null,null,null,"Income from increased productivity",1185660,1197516.6000000001,-11856.600000000093]
[null,null,null,null,null,null,null,null,null,null,null,null,null,null,null,null,null,null,null,null,null,null,null,null,null,null,null,null,null,null,null,null,null,null,null,null,null,null,null,"Cost of staff turnover",50986.106557377047,42063.537909836065,-8922.5686475409821]
[null,null,null,null,null,null,null,null,null,null,null,null,null,null,null,null,null,null,null,null,null,null,null,null,null,null,null,null,null,null,null,null,null,null,null,null,null,null,null,"Healthcare costs",0,0,0]
[null,null,null,null,null,null,null,null,null,null,null,null,null,null,null,null,null,null,null,null,null,null,null,null,null,null,null,null,null,null,null,null,null,null,null,null,null,null,null,"Societal costs",0,0,0]
[null,null,null,null,null,null,null,null,null,null,null,null,null,null,null,null,null,null,null,null,null,null,null,null,null,null,null,null,null,null,null,null,null,null,null,null,null,null,null,"Intervention cost",0,6000,6000]
[null,null,null,null,null,null,null,null,null,null,null,null,null,null,null,null,null,null,null,null,null,null,null,null,null,null,null,null,null,null,null,null,null,null,null,null,null,null,null,"Total",1262148.5065573771,1268532.2979098361,-17329.408647541073]
{"$rows_left_out":118}
{"sheet":"SAProd","index":8,"n_rows":137,"n_cols":49,"rows_kept":137,"cut":false,"hidden":false,"merged":[[3,2,3,3],[121,3,121,7]]}
[]
[]
[]
[null,null,"XXXXXXXXXXX"]
[]
[]
[]
[]
[]
[]
[]
[]
[null,null,null,null,null,null,null,null,null,null,null,null,null,null,null,null,null,null,null,null,null,null,null,null,null,null,null,null,null,null,null,null,null,null,null,null,null,null,null,null,"Before","After","Difference"]
[null,null,null,null,null,null,null,null,null,null,null,null,null,null,null,null,null,null,null,null,null,null,null,null,null,null,null,null,null,null,null,null,null,null,null,null,null,null,null,"Cost of absenteeism",25502.399999999998,22952.16,-2550.239999999998]
[null,null,null,null,null,null,null,null,null,null,null,null,null,null,null,null,null,null,null,null,null,null,null,null,null,null,null,null,null,null,null,null,null,null,null,null,null,null,null,"Income from increased productivity",1185660,1197516.6000000001,-11856.600000000093]
[null,null,null,null,null,null,null,null,null,null,null,null,null,null,null,null,null,null,null,null,null,null,null,null,null,null,null,null,null,null,null,null,null,null,null,null,null,null,null,"Cost of staff turnover",50986.106557377047,42063.537909836065,-8922.5686475409821]
[null,null,null,null,null,null,null,null,null,null,null,null,null,null,null,null,null,null,null,null,null,null,null,null,null,null,null,null,null,null,null,null,null,null,null,null,null,null,null,"Healthcare costs",0,0,0]
[null,null,null,null,null,null,null,null,null,null,null,null,null,null,null,null,null,null,null,null,null,null,null,null,null,null,null,null,null,null,null,null,null,null,null,null,null,null,null,"Societal costs",0,0,0]
[null,null,null,null,null,null,null,null,null,null,null,null,null,null,null,null,null,null,null,null,null,null,null,null,null,null,null,null,null,null,null,null,null,null,null,null,null,null,null,"Intervention cost",0,6000,6000]
[null,null,null,null,null,null,null,null,null,null,null,null,null,null,null,null,null,null,null,null,null,null,null,null,null,null,null,null,null,null,null,null,null,null,null,null,null,null,null,"Total",1262148.5065573771,1268532.2979098361,-17329.408647541073]
{"$rows_left_out":118}
{"sheet":"SATurnover","index":9,"n_rows":137,"n_cols":49,"rows_kept":137,"cut":false,"hidden":false,"merged":[[3,2,3,3],[121,3,121,7]]}
[]
[]
[]
[null,null,"XXXXXXXXXXX"]
[]
[]
[]
[]
[]
[]
[]
[]
[null,null,null,null,null,null,null,null,null,null,null,null,null,null,null,null,null,null,null,null,null,null,null,null,null,null,null,null,null,null,null,null,null,null,null,null,null,null,null,null,"Before","After","Difference"]
[null,null,null,null,null,null,null,null,null,null,null,null,null,null,null,null,null,null,null,null,null,null,null,null,null,null,null,null,null,null,null,null,null,null,null,null,null,null,null,"Cost of absenteeism",25502.399999999998,22952.16,-2550.239999999998]
[null,null,null,null,null,null,null,null,null,null,null,null,null,null,null,null,null,null,null,null,null,null,null,null,null,null,null,null,null,null,null,null,null,null,null,null,null,null,null,"Income from increased productivity",1185660,1197516.6000000001,-11856.600000000093]
[null,null,null,null,null,null,null,null,null,null,null,null,null,null,null,null,null,null,null,null,null,null,null,null,null,null,null,null,null,null,null,null,null,null,null,null,null,null,null,"Cost of staff turnover",50986.106557377047,42063.537909836065,-8922.5686475409821]
[null,null,null,null,null,null,null,null,null,null,null,null,null,null,null,null,null,null,null,null,null,null,null,null,null,null,null,null,null,null,null,null,null,null,null,null,null,null,null,"Healthcare costs",0,0,0]
[null,null,null,null,null,null,null,null,null,null,null,null,null,null,null,null,null,null,null,null,null,null,null,null,null,null,null,null,null,null,null,null,null,null,null,null,null,null,null,"Societal costs",0,0,0]
[null,null,null,null,null,null,null,null,null,null,null,null,null,null,null,null,null,null,null,null,null,null,null,null,null,null,null,null,null,null,null,null,null,null,null,null,null,null,null,"Intervention cost",0,6000,6000]
[null,null,null,null,null,null,null,null,null,null,null,null,null,null,null,null,null,null,null,null,null,null,null,null,null,null,null,null,null,null,null,null,null,null,null,null,null,null,null,"Total",1262148.5065573771,1268532.2979098361,-17329.408647541073]
{"$rows_left_out":117}