{"text_format":"1","workbook":"xlsx","n_sheets":59,"sheets":["Control","Title Sheet","Overview","Set Up","Model Inputs","Intervention Cost","RR tables","Additional Monetary Impact","Utility","MENU1B5","MENU1B6","MENU1B7","MENU1B8","Utility reference","Overall","Per student","MENU2B3","MENU2B4","MENU2B5","MENU2B6","MENU2B7","MENU2B8","MENU3B1","MENU3B2","MENU3B3","MENU3B4","MENU3B5","MENU3B6","MENU3B7","MENU3B8","MENU4B1","MENU4B2","MENU4B3","MENU4B4","MENU4B5","MENU4B6","MENU4B7","MENU4B8","MENU5B1","MENU5B2","MENU5B3","MENU5B4","MENU5B5","MENU5B6","MENU5B7","MENU5B8","MENU6B1","MENU6B2","MENU6B3","MENU6B4","MENU6B5","MENU6B6","MENU6B7","MENU6B8","Sensitivity Analysis","Templates","Changes log","Sheet2","Sheet1"],"not_rendered":{"charts":33,"images":8,"macros":1,"external_links":1,"defined_names":45,"comments":4,"pivot_tables":0},"unopened":[],"bounds":{"document_bytes":16777216,"sheet_cells":100000,"rows_first":2000,"rows_last":500,"rows_between":2000,"halvings":0,"cell_chars":16384,"cell_head_chars":4096},"cells_cut":0,"cells_raw":0,"read":"whole","date_system":"1900"}

{"sheet":"Control","index":0,"n_rows":32,"n_cols":10,"rows_kept":32,"cut":false,"hidden":false,"merged":[[0,1,0,8]]}
["Menu Text","Button Text/Sheet Names"]
["Inputs","Set Up","Outcome Relative Risk","Additional Monetary Impact","Utility",".",".",".","."]
["Results","Overall","Per student","Sensitivity Analysis",".",".",".",".","."]
[".",".",".",".",".",".",".",".","."]
[".",".",".",".",".",".",".",".","."]
[".",".",".",".",".",".",".",".","."]
[".",".",".",".",".",".",".",".","."]
[]
[]
[]
[]
[null,null,null,null,null,null,null,null,null,"Colour coding of sheet tabs:"]
[]
[null,null,null,null,null,null,null,null,null,"LIVE Sheet"]
[]
{"$rows_left_out":18}
{"sheet":"Title Sheet","index":1,"n_rows":27,"n_cols":19,"rows_kept":27,"cut":false,"hidden":false,"merged":[[26,3,56,12],[11,3,13,13],[17,3,17,5],[19,3,19,5],[21,3,21,5],[23,3,23,5]]}
[]
[]
[]
[null,null,null,null,null,null,null,null,null,null,null,null,null,null,null,null,null,null,"Laura Coote, Erin Barker, Matthew Taylor"]
[]
[]
[]
[]
[]
[]
[]
[null,null,null,"Warning for model users: Due to substantial variability in the interventions available and heterogeneity across schools it is neither possible, nor judicious, for this model to provide ‘generalised’ results. It is recommended that the model is used to explore the potential economic and wellbeing implications so that each school or wider decision maker can evaluate its own most likely scenario. "]
[]
[]
[null,null,null,"Explanatory video on how to use the model"]
{"$rows_left_out":13}
{"sheet":"Overview","index":2,"n_rows":37,"n_cols":6,"rows_kept":37,"cut":false,"hidden":true,"merged":[]}
[]
[]
[]
[]
[]
[]
[]
[]
[]
[]
[null,null,null,"Navigating the model"]
[]
[]
[]
[]
{"$rows_left_out":23}
{"sheet":"Set Up","index":3,"n_rows":103,"n_cols":74,"rows_kept":103,"cut":false,"hidden":false,"merged":[[87,3,87,4]]}
[]
[]
[]
[]
[]
[]
[]
[]
[]
[]
[null,null,null,"Perspective:"]
[]
[null,null,null,"Approach:","Universal",null,"Total cost of intervention",{"$f":"IF('Intervention Cost'!D28=\"\",'Intervention Cost'!D24,'Intervention Cost'!D28)","v":0}]
[]
[null,null,null,"Intervention type:","Please select...",null,"Number of students",100]
{"$rows_left_out":89}
{"sheet":"Model Inputs","index":4,"n_rows":305,"n_cols":106,"rows_kept":305,"cut":false,"hidden":false,"merged":[[289,5,293,5],[284,6,284,32],[286,5,288,5],[13,79,13,104],[15,78,17,78],[26,73,26,98],[31,78,35,78],[38,79,38,104],[40,78,42,78],[43,78,47,78],[51,79,51,104],[53,78,55,78],[56,78,60,78],[42,5,42,6]]}
[]
[]
[]
[]
[]
[]
[]
[]
[]
[]
[]
[]
[null,null,null,"Interventions",null,null,null,null,null,null,null,"Utility "]
[null,null,null,"Approaches","Universal","Whole_school","Targeted","Transitions","Outcomes","Column number on RR table sheet",null,"Inputs",null,null,"QALY Calculation",null,null,null,null,null,null,null,"FRIENDS for Life","CBT","FRIENDS","Zippy's Friends","PATHS","RAP","LARS & LISA","SPARX-R","Op Volle Kracht","AOP","Mindfulness","HeadStrong","MoodGYM","Pozik Bizi","E-Couch","E-GAD","MindOut","Coping Power Unviversal","Taking Action Program","ThisWayUp","ITPFSA","StrongKids","Yoga","Working Things Out","Uplifting out health and wellbeing",null,null,null,null,null,null,null,null,null,null,null,null,null,null,null,null,null,null,null,null,null,null,null,null,null,null,null,null,null,null,"Universal",null,"    Outcomes (RR)"]
[null,null,null,"Universal","FRIENDS_for_Life","Antibullying_with_curriculum","MH_group_specialist","Transition_between_schools",{"$f":"'RR tables'!E11","v":"Emotional distress"},1,null,"Monetary value per QALY",{"$f":"Utility!E12","v":20000},null,"Improvement?",{"$f":"IF(AND(M38>=1,G44=1),1,IF(AND(M38<1,G44=1),-1,IF(AND(M38>=1,G44=2),-1,IF(AND(M38<1, G44=2),1))))","v":{"$error":"#N/A"}},null,null,null,null,null,null,"Emotional distress","Emotional distress","Emotional distress","X - Emotional distress","X - Emotional distress","Emotional distress","Emotional distress","Emotional distress","Emotional distress","Emotional distress","Emotional distress","Emotional distress","Emotional distress","Emotional distress","Emotional distress","Emotional distress","Emotional distress","Emotional distress","Emotional distress","Emotional distress","Emotional distress","X - Emotional distress","X - Emotional distress","X - Emotional distress","X - Emotional distress",null,null,null,null,null,null,null,null,null,null,null,null,null,null,null,null,null,null,null,null,null,null,null,null,null,null,null,null,null,null,"Intervention type","Description","Emotional distress","Depression","Self-esteem","Empathy","Psychological problems","Emotional wellbeing","Wellbeing","Social and emotional skills","Cooperation","Social adjustment","Behavioural outcomes","Behavioural outcomes (difficulties)","Behavioural outcomes (prosocial)","Perpetration","Victimisation","Perpetration (primary)","Perpetration (secondary)","Victimisation (primary)","Victimisation (secondary)","Cyberbullying perpetration","Cyberbullying victimisation","Exclusion","Truancy","School attendance","School climate","Response"]
{"$rows_left_out":291}
{"sheet":"Intervention Cost","index":5,"n_rows":28,"n_cols":8,"rows_kept":28,"cut":false,"hidden":false,"merged":[]}
[]
[]
[]
[]
[]
[]
[]
[]
[null,null,"Total cost of intervention breakdown"]
[]
[null,null,"Staff breakdown","Number of staff required","Hours dedicated to intervention","Hourly rate","Travel costs","Total"]
[null,null,"[Health leaders]",null,null,null,null,{"$f":"((E12*F12)*D12)+G12","v":0}]
[null,null,"[Teachers]",null,null,null,null,{"$f":"((E13*F13)*D13)+G13","v":0}]
[null,null,"[Teaching assistants]",null,null,null,null,0]
[null,null,null,null,null,null,null,0]
{"$rows_left_out":14}
{"sheet":"RR tables","index":6,"n_rows":62,"n_cols":24,"rows_kept":62,"cut":false,"hidden":false,"merged":[[59,4,59,23],[41,2,42,2],[48,2,55,2],[9,4,9,23],[39,4,39,23],[46,4,46,23],[11,2,35,2]]}
[]
[]
[]
[]
[]
[]
[]
[]
[]
[null,"Universal approach",null,null,"    Outcomes (RR)"]
[null,"Intervention type","Description","Setting","Emotional distress","CI","Behavioural skills","CI","Social and emotional skills","CI","Self-esteem","CI","Prosocial behaviour skills","CI","Bullying perpetration","CI","Emotional distress - primary education","CI","Emotional distress - secondary education","CI","Behavioural skills- primary education","CI","Behavioural skills - secondary education","CI"]
[null,{"$f":"'Model Inputs'!E15","v":"FRIENDS_for_Life"},"Offer ‘social and emotional skills-based’ lessons as part of the curriculum",null,1,"[0.99, 1.01]",0.87,"[0.76, 0.99]","No available evidence",null,"No available evidence",null,"No available evidence",null,"No available evidence",null,"No available evidence",null,"No available evidence",null,"No available evidence",null,"No available evidence"]
[null,{"$f":"'Model Inputs'!E16","v":"CBT"},null,null,1.1299999999999999,"[0.92, 1.39]","No available evidence",null,"No available evidence",null,"No available evidence",null,"No available evidence",null,"No available evidence",null,"No available evidence",null,"No available evidence",null,"No available evidence",null,"No available evidence"]
[null,{"$f":"'Model Inputs'!E17","v":"FRIENDS"},null,null,1.01,"[0.92, 1.10]","No available evidence",null,1,"[0.95, 1.07]","No available evidence",null,"No available evidence",null,"No available evidence",null,"No available evidence",null,"No available evidence",null,"No available evidence",null,"No available evidence"]
[null,{"$f":"'Model Inputs'!E18","v":"Zippys_Friends"},null,null,"No available evidence",null,1,"[0.99,1.01]","No available evidence",null,"No available evidence",null,"No available evidence",null,"No available evidence",null,"No available evidence",null,"No available evidence",null,"No available evidence",null,"No available evidence"]
{"$rows_left_out":48}
{"sheet":"Additional Monetary Impact","index":7,"n_rows":22,"n_cols":8,"rows_kept":22,"cut":false,"hidden":false,"merged":[[14,3,14,4],[13,3,13,4],[21,3,21,6],[18,3,18,4],[15,3,15,4],[19,3,19,4]]}
[]
[]
[]
[]
[]
[]
[]
[]
[]
[]
[]
[]
[null,null,null,"Additional monetary values - Educational Setting",null,"Base case","User defined","Used in model"]
[null,null,null,"[placeholder]",null,null,null,{"$f":"IF(G14=\"\",F14,G14)","v":0}]
[null,null,null,"[placeholder]",null,null,null,{"$f":"IF(G15=\"\",F15,G15)","v":0}]
{"$rows_left_out":8}
{"sheet":"Utility","index":8,"n_rows":102,"n_cols":74,"rows_kept":102,"cut":false,"hidden":false,"merged":[[16,3,16,5],[15,3,15,5],[18,3,18,5],[10,8,10,13],[12,6,12,7],[17,4,17,5],[17,6,18,9]]}
[]
[]
[]
[]
[]
[]
[]
[]
[]
[]
[]
[null,null,null,"Monetary equivalent per QALY",20000,null,"Utility ",null,"Base case","User defined","Used in model"]
[null,null,null,"Discount value",3.5000000000000003E-2,null,{"$f":"CONCATENATE(\"Utility equivalent of a student living without \",'Model Inputs'!M39,\"\")","v":"Utility equivalent of a student living without please select..."},null,null,0,{"$f":"IF(J13=\"\",ABS(I13),ABS(J13))","v":0}]
[null,null,null,"Expected length of benefit (years)"]
[]
{"$rows_left_out":88}
{"sheet":"MENU1B5","index":9,"n_rows":0,"n_cols":0,"rows_kept":0,"cut":false,"hidden":true,"merged":[]}

{"sheet":"MENU1B6","index":10,"n_rows":0,"n_cols":0,"rows_kept":0,"cut":false,"hidden":true,"merged":[]}

{"sheet":"MENU1B7","index":11,"n_rows":0,"n_cols":0,"rows_kept":0,"cut":false,"hidden":true,"merged":[]}

{"sheet":"MENU1B8","index":12,"n_rows":0,"n_cols":0,"rows_kept":0,"cut":false,"hidden":true,"merged":[]}

{"sheet":"Utility reference","index":13,"n_rows":30,"n_cols":15,"rows_kept":30,"cut":false,"hidden":false,"merged":[[9,12,9,17]]}
[]
[]
[]
[]
[]
[]
[]
[]
[]
[null,null,null,null,null,null,null,null,null,null,null,null,{"$f":"CONCATENATE(\"To determine the utility equivalent of a student living without \",'Model Inputs'!M39)","v":"To determine the utility equivalent of a student living without please select..."}]
[]
[null,null,null,null,null,null,null,null,null,null,null,null,"Baseline utility score under 25",0.94]
[]
[null,null,null,null,null,null,null,null,null,null,null,null,"Condition","Utility score","From condition to baseline"]
[null,null,null,null,null,null,null,null,null,null,null,null,"Full health",1]
{"$rows_left_out":16}
{"sheet":"Overall","index":14,"n_rows":25,"n_cols":5,"rows_kept":25,"cut":false,"hidden":false,"merged":[[15,3,15,4],[15,62,15,64],[14,62,14,64],[21,3,21,4],[11,3,11,4]]}
[]
[]
[]
[]
[]
[]
[]
[]
[]
[]
[]
[null,null,null,"Student outcomes:"]
[null,null,null,{"$f":"IF('Model Inputs'!P15=1,CONCATENATE(\"Number of students seeing improvement regarding \", 'Model Inputs'!M39), CONCATENATE(\"Number of students with worsening \", 'Model Inputs'!M39))","v":{"$error":"#N/A"}},{"$f":"ROUND('Model Inputs'!M33,0)","v":0}]
[null,null,null,{"$f":"IF('Model Inputs'!P15=1, CONCATENATE(\"Cost per case of \", 'Model Inputs'!M39, \" improvement\"), CONCATENATE(\"Cost per case of \", 'Model Inputs'!M39, \" worsen\"))","v":{"$error":"#N/A"}},{"$f":"ABS((IF(E13=0,0,((E17+E18)/E13))))","v":0}]
[]
{"$rows_left_out":11}
{"sheet":"Per student","index":15,"n_rows":24,"n_cols":5,"rows_kept":24,"cut":false,"hidden":false,"merged":[[20,3,20,4],[14,3,14,4],[11,3,11,4]]}
[]
[]
[]
[]
[]
[]
[]
[]
[]
[]
[]
[null,null,null,"Student outcomes:"]
[null,null,null,{"$f":"IF('Model Inputs'!P15=1,\"Likelihood of a student benefiting from the intervention\", \"Likelihood of a student worse-off following the intervention\")","v":{"$error":"#N/A"}},{"$f":"'Model Inputs'!M33/'Model Inputs'!M37","v":0}]
[]
[null,null,null,"Per student:"]
{"$rows_left_out":10}
{"sheet":"MENU2B3","index":16,"n_rows":0,"n_cols":0,"rows_kept":0,"cut":false,"hidden":true,"merged":[]}

{"sheet":"MENU2B4","index":17,"n_rows":0,"n_cols":0,"rows_kept":0,"cut":false,"hidden":true,"merged":[]}

{"sheet":"MENU2B5","index":18,"n_rows":0,"n_cols":0,"rows_kept":0,"cut":false,"hidden":true,"merged":[]}

{"sheet":"MENU2B6","index":19,"n_rows":0,"n_cols":0,"rows_kept":0,"cut":false,"hidden":true,"merged":[]}

{"sheet":"MENU2B7","index":20,"n_rows":0,"n_cols":0,"rows_kept":0,"cut":false,"hidden":true,"merged":[]}

{"sheet":"MENU2B8","index":21,"n_rows":0,"n_cols":0,"rows_kept":0,"cut":false,"hidden":true,"merged":[]}

{"sheet":"MENU3B1","index":22,"n_rows":0,"n_cols":0,"rows_kept":0,"cut":false,"hidden":true,"merged":[]}

{"sheet":"MENU3B2","index":23,"n_rows":0,"n_cols":0,"rows_kept":0,"cut":false,"hidden":true,"merged":[]}

{"sheet":"MENU3B3","index":24,"n_rows":0,"n_cols":0,"rows_kept":0,"cut":false,"hidden":true,"merged":[]}

{"sheet":"MENU3B4","index":25,"n_rows":0,"n_cols":0,"rows_kept":0,"cut":false,"hidden":true,"merged":[]}

{"sheet":"MENU3B5","index":26,"n_rows":0,"n_cols":0,"rows_kept":0,"cut":false,"hidden":true,"merged":[]}

{"sheet":"MENU3B6","index":27,"n_rows":0,"n_cols":0,"rows_kept":0,"cut":false,"hidden":true,"merged":[]}

{"sheet":"MENU3B7","index":28,"n_rows":0,"n_cols":0,"rows_kept":0,"cut":false,"hidden":true,"merged":[]}

{"sheet":"MENU3B8","index":29,"n_rows":0,"n_cols":0,"rows_kept":0,"cut":false,"hidden":true,"merged":[]}

{"sheet":"MENU4B1","index":30,"n_rows":0,"n_cols":0,"rows_kept":0,"cut":false,"hidden":true,"merged":[]}

{"sheet":"MENU4B2","index":31,"n_rows":0,"n_cols":0,"rows_kept":0,"cut":false,"hidden":true,"merged":[]}

{"sheet":"MENU4B3","index":32,"n_rows":0,"n_cols":0,"rows_kept":0,"cut":false,"hidden":true,"merged":[]}

{"sheet":"MENU4B4","index":33,"n_rows":0,"n_cols":0,"rows_kept":0,"cut":false,"hidden":true,"merged":[]}

{"sheet":"MENU4B5","index":34,"n_rows":0,"n_cols":0,"rows_kept":0,"cut":false,"hidden":true,"merged":[]}

{"sheet":"MENU4B6","index":35,"n_rows":0,"n_cols":0,"rows_kept":0,"cut":false,"hidden":true,"merged":[]}

{"sheet":"MENU4B7","index":36,"n_rows":0,"n_cols":0,"rows_kept":0,"cut":false,"hidden":true,"merged":[]}

{"sheet":"MENU4B8","index":37,"n_rows":0,"n_cols":0,"rows_kept":0,"cut":false,"hidden":true,"merged":[]}

{"sheet":"MENU5B1","index":38,"n_rows":0,"n_cols":0,"rows_kept":0,"cut":false,"hidden":true,"merged":[]}

{"sheet":"MENU5B2","index":39,"n_rows":0,"n_cols":0,"rows_kept":0,"cut":false,"hidden":true,"merged":[]}

{"sheet":"MENU5B3","index":40,"n_rows":0,"n_cols":0,"rows_kept":0,"cut":false,"hidden":true,"merged":[]}

{"sheet":"MENU5B4","index":41,"n_rows":0,"n_cols":0,"rows_kept":0,"cut":false,"hidden":true,"merged":[]}

{"sheet":"MENU5B5","index":42,"n_rows":0,"n_cols":0,"rows_kept":0,"cut":false,"hidden":true,"merged":[]}

{"sheet":"MENU5B6","index":43,"n_rows":0,"n_cols":0,"rows_kept":0,"cut":false,"hidden":true,"merged":[]}

{"sheet":"MENU5B7","index":44,"n_rows":0,"n_cols":0,"rows_kept":0,"cut":false,"hidden":true,"merged":[]}

{"sheet":"MENU5B8","index":45,"n_rows":0,"n_cols":0,"rows_kept":0,"cut":false,"hidden":true,"merged":[]}

{"sheet":"MENU6B1","index":46,"n_rows":0,"n_cols":0,"rows_kept":0,"cut":false,"hidden":true,"merged":[]}

{"sheet":"MENU6B2","index":47,"n_rows":0,"n_cols":0,"rows_kept":0,"cut":false,"hidden":true,"merged":[]}

{"sheet":"MENU6B3","index":48,"n_rows":0,"n_cols":0,"rows_kept":0,"cut":false,"hidden":true,"merged":[]}

{"sheet":"MENU6B4","index":49,"n_rows":0,"n_cols":0,"rows_kept":0,"cut":false,"hidden":true,"merged":[]}

{"sheet":"MENU6B5","index":50,"n_rows":0,"n_cols":0,"rows_kept":0,"cut":false,"hidden":true,"merged":[]}

{"sheet":"MENU6B6","index":51,"n_rows":0,"n_cols":0,"rows_kept":0,"cut":false,"hidden":true,"merged":[]}

{"sheet":"MENU6B7","index":52,"n_rows":0,"n_cols":0,"rows_kept":0,"cut":false,"hidden":true,"merged":[]}

{"sheet":"MENU6B8","index":53,"n_rows":0,"n_cols":0,"rows_kept":0,"cut":false,"hidden":true,"merged":[]}

{"sheet":"Sensitivity Analysis","index":54,"n_rows":18,"n_cols":74,"rows_kept":18,"cut":false,"hidden":false,"merged":[]}
[]
[]
[]
[]
[]
[]
[]
[]
[]
[]
[null,null,null,"Perspective:",{"$f":"IF('Set Up'!D89=2, \"Societal\", \"Educational\")","v":"Educational"}]
[null,null,null,null,null,null,null,null,null,null,null,null,null,null,null,null,null,null,null,null,null,null,null,null,null,null,null,null,null,null,null,null,null,null,null,null,null,null,null,null,null,null,null,null,null,null,null,null,null,null,null,null,null,null,null,null,null,null,null,null,null,null,null,null,null,null,null,null,null,{"$f":"IF(E13=BU14,1,IF(E13=BU15,2,IF(E13=BU16,3,IF(E13=BV17,4))))","v":false}]
[null,null,null,"Variable selected:","Utility size given to bullying perpetration",null,null,null,null,null,null,null,null,null,null,null,null,null,null,null,null,null,null,null,null,null,null,null,null,null,null,null,null,null,null,null,null,null,null,null,null,null,null,null,null,null,null,null,null,null,null,null,null,null,null,null,null,null,null,null,null,null,null,null,null,null,null,null,null,null,null,null,"Educational","Societal"]
[null,null,null,null,null,null,null,null,null,null,null,null,null,null,null,null,null,null,null,null,null,null,null,null,null,null,null,null,null,null,null,null,null,null,null,null,null,null,null,null,null,null,null,null,null,null,null,null,null,null,null,null,null,null,null,null,null,null,null,null,null,null,null,null,null,null,null,null,null,null,null,null,"Intervention cost","Intervention cost"]
[null,null,null,null,null,null,null,null,null,null,null,null,null,null,null,null,null,null,null,null,null,null,null,null,null,null,null,null,null,null,null,null,null,null,null,null,null,null,null,null,null,null,null,null,null,null,null,null,null,null,null,null,null,null,null,null,null,null,null,null,null,null,null,null,null,null,null,null,null,null,null,null,"Number of students","Number of students"]
{"$rows_left_out":4}
{"sheet":"Templates","index":55,"n_rows":1134,"n_cols":28,"rows_kept":1134,"cut":false,"hidden":false,"merged":[[49,3,49,13],[51,0,61,1],[117,17,117,19],[118,17,118,19],[119,17,119,19],[81,2,81,3],[81,4,81,5],[120,17,120,19],[113,17,113,19],[114,17,114,19],[115,17,115,19],[116,17,116,19]]}
[]
["Graphs"]
[]
[]
[null,null,null,null,null,null,null,null,null,null,"Cost breakdown"]
[]
[null,null,null,null,null,null,null,null,null,null,null,null,null,null,null,null,null,null,null,null,null,null,null,null,"Tornado diagram"]
[]
[]
[]
[]
[]
[]
[]
[]
{"$rows_left_out":1120}
{"sheet":"Changes log","index":56,"n_rows":37,"n_cols":4,"rows_kept":37,"cut":false,"hidden":false,"merged":[]}
[]
[null,"Name (initials)","Date","Action"]
[]
[]
[]
[]
[]
[]
[]
[]
[]
[]
[]
[]
[]
{"$rows_left_out":23}
{"sheet":"Sheet2","index":57,"n_rows":0,"n_cols":0,"rows_kept":0,"cut":false,"hidden":false,"merged":[]}

{"sheet":"Sheet1","index":58,"n_rows":0,"n_cols":0,"rows_kept":0,"cut":false,"hidden":false,"merged":[]}